作者 主題: Mysql安裝出現錯誤???  (閱讀 1108 次)

0 會員 與 1 訪客 正在閱讀本文。

briantn

  • 可愛的小學生
  • *
  • 文章數: 20
    • 檢視個人資料
Mysql安裝出現錯誤???
« 於: 2004-07-07 15:59 »
在安裝Mysql時出現以下錯誤
mi_write.c: In function `_mi_balance_page':
mi_write.c:663: `jew_right_length' undeclared (first use in this function)
mi_write.c:663: (Each undeclared identifier is reported only once
mi_write.c:663: for each function it appears in.)
make[2]: *** [mi_write.o] Error 1
make[2]: Leaving directory `/tmp2/mysql-3.23.58/myisam'
make[1]: *** [all-recursive] Error 1
make[1]: Leaving directory `/tmp2/mysql-3.23.58'
make: *** [all] Error 2
有嘗試找過問題原因,至目前尚未找到解答因此想請教一下此錯誤如何解決呢???